Home > Error Code > Cod Error54

Cod Error54

Contents

Error code: 122 SET_EXISTENCE_CHECKING_NOT_UNDERSTOOD Cause: The interface descriptor must have at least one abstract query key defined. Java throws the error and TopLink only wraps the reflection exception. E6 Error Code The E6 error indicates an error with the clutch. If the project files are not manually edited and corrupted then this is usually an internal exception to TopLink and must be reported to Technical Support.

All Rights Reserved. Error code: 1030 Invocation target exception Cause: Java is throwing reflection exception while invoking the method on the object. Java throws the error and TopLink only wraps the reflection exception. CURLcode Almost all "easy" interface functions return a CURLcode error code. https://docs.oracle.com/cd/A97688_16/toplink.903/b10068/errorcod.htm

Error Code List

At least one other device that uses that IRQ was already opened. [ERROR_IRQ_BUSY (0x45F)]Error Code 1120: A serial I/O operation was completed by another write to the serial port. To prevent future occurance of the dE error: The drum can be fully loaded but not tightly packed so that it would force the door out of alignment. CURLE_HTTP2 (16) A problem was detected in the HTTP2 framing layer.

Action: Inspect the internal exception and check the Java manuals. Error code: 1026 Not enough INI elements. Error code: 38 INVALID_IDENTITY_MAP Cause: Identity map constructor failed because an invalid identity map was specified. Db2 Error Code CURLE_TFTP_UNKNOWNID (72) Unknown TFTP transfer ID.

Error code: 96 TARGET_FOREIGN_KEYS_SIZE_MISMATCH Cause: The size of the foreign keys on the target table does not match the size of the source keys on the source table in one to Error Codes List TopLink does the assignment of value by using Java reflection. Error code: 51 NO_FOREIGN_KEYS_ARE_SPECIFIED Cause: Neither the selection criteria nor the foreign keys were specified on one-to-one mapping. Action: Inspect the internal exception and check the Java manuals.

CURLE_SSL_CACERT_BADFILE (77) Problem with reading the SSL CA cert (path? Error 404 The file or directory is corrupted and unreadable." I've tried all of the troubleshooting "R's" except Restore because I have 3500 songs and really don't want to erase them all if Error code: 1009 Accessing on with Cause: Java is throwing reflection exception while invoking the method on the object. Click here for how to enter without purchasing or registering a product and Official Rules.

Error Codes List

Java reflection exception wrapped in TopLink exception is thrown when class extraction method is being created from the method name in inheritance policy. navigate to this website CURLcode is one of the following: CURLE_OK (0) All fine. Error Code List CURLE_FTP_BAD_FILE_LIST (87) Unable to parse FTP file list (during FTP wildcard downloading). Cydoor Spyware Error code: 109 WRITE_LOCK_FIELD_IN_CHILD_DESCRIPTOR Cause: The child descriptor should not have a write lock field defined because it gets it from the parent descriptor.

CURLE_CHUNK_FAILED (88) Chunk callback reported error. Error code: 171 INSTANTIATION_WHILE_CONSTRUCTOR_ INSTANTIATION_OF_FACTORY Cause: An instantiation failed inside the associated constructor. CURLE_INTERFACE_FAILED (45) Interface error. The system has been shut down. [ERROR_SYSTEM_IMAGE_BAD_SIGNATURE (0x27D)]Error Code 638: Device will not start without a reboot. [ERROR_PNP_REBOOT_REQUIRED (0x27E)]Error Code 639: There is not enough power to complete the requested operation. Http Error Code

This device will not be used. Action: Check that the container policy is correct for the collection type. Java throws security exception when creating Field type from the given attribute name using Java reflection. The pedestal washer will not operate as a standalone unit.

Java throws security exception when a Method type is created from the attribute method name using Java reflection. CURLE_FTP_PORT_FAILED (30) The FTP PORT command returned error. CURLM_OK (0) Things are fine.

Action: Inspect the internal exception and check the Java manuals.

If you have additional suggestions regarding the System Error Codes documentation, given the constraints enumerated at the top of the page, please click the link labeled "Send comments about this topic Action: Verify the table name. Action: Avoid sending a message to null. Get OS X instead!

For FTP, this occurs while trying to change to the remote directory. Before opening files in this location, you must first add the web site to your trusted sites list, browse to the web site, and select the option to login automatically. Action: Determine why the message send is illegal, and replace the message with the proper legal one. Overall, how satisfied were you with the usefulness of this information?

CURLE_OPERATION_TIMEDOUT (28) Operation timeout. Action: Implement the constructor for the container. Action: Inspect the internal exception and check the Java manuals. Putting strain on the door hinge could cause a misalignment.

Error code: 91 SEQUENCE_NUMBER_PROPERTY_NOT_SPECIFIED Cause: Either the sequence field name or the sequence number name is missing.